{"text_format":"1","workbook":"xlsx","n_sheets":5,"sheets":["Version","OPTA Generator","Werte","OPTA Tabelle","STC Hinweise"],"not_rendered":{"charts":0,"images":1,"macros":1,"external_links":0,"defined_names":8,"comments":0,"pivot_tables":0},"unopened":[],"bounds":{"document_bytes":16777216,"sheet_cells":100000,"rows_first":2000,"rows_last":500,"rows_between":2000,"halvings":0,"cell_chars":16384,"cell_head_chars":4096},"cells_cut":0,"cells_raw":0,"read":"whole","date_system":"1900"}

{"sheet":"Version","index":0,"n_rows":35,"n_cols":5,"rows_kept":35,"cut":false,"hidden":true,"merged":[]}
[]
[]
[]
[null,"Version","Datum","Bearbeiter","Änderungen"]
[null,"00.00.01","2011-07-04","Jens-Peter Staack","Erster Entwurf nach Vorlage FW Hessen\nQuelle: http://feuerwehr-maintal.de/index.php?mid=68&download=137"]
[null,"00.00.02","2011-07-04","Jens-Peter Staack","Änderungen: SVERWEIS\n(siehe Anmerkungen http://www.online-excel.de/excel/singsel.php?f=9)"]
[null,"00.00.03","2011-07-05","Jens-Peter Staack","#NV Fehler abfangen mit ISTFEHLER, Abfangen der 9 zeichen Normbezeichnung mit Wenn Abfrage"]
[null,"00.00.04","2011-07-05","Jens-Peter Staack","Einpflegen der Funknamen in BB\nQuelle: N:\\TP4\\23_Fleetmapping Planung\\01_Fleetmapping\\Fleetmapping nPol\\Funrufnamenschema.xls\n-> Nur FW implementiert in der Auswahlliste"]
[null,"00.00.05","2011-07-06","Jens-Peter Staack","Anmerkungen zu den Funknamen durch Hr. Schellhorn"]
[null,"00.00.06","2011-07-07","Jens-Peter Staack","Kleine Verbesserungen, u.a. Courier Schrift"]
[null,"00.00.07","2011-07-07","Jens-Peter Staack","Makro"]
[null,"00.00.08","2011-07-14","Jens-Peter Staack","Einpflegen der Daten \"Städt und Landkreis\" in die Tabelle \"Werte\""]
[null,"00.00.09","2011-07-15","Jens-Peter Staack","Einpflegen der überarbeiteten Daten der Städt und Landkreis in die Tabelle \"Werte\"\n(Quelldatei TEST nPol_akt1_23082010_V01_Gross_STC.xls)\nLayoutänderungen (OPTA Block unterhalb der Auswahl)"]
[null,"00.00.10","2011-07-21","Jens-Peter Staack","Funkrufnamen: Einpflegen des Katastrophenschutzes, Anpassungen entsprechender BB Vorgaben und OPTA Richtlinie"]
[null,"00.00.11","2011-08-19","Jens-Peter Staack","Korrektur für Auswahl MI ('MI ) und PR ('PR )"]
{"$rows_left_out":21}
{"sheet":"OPTA Generator","index":1,"n_rows":38,"n_cols":64,"rows_kept":38,"cut":false,"hidden":false,"merged":[[14,8,14,24],[24,1,24,20],[23,1,23,20],[12,8,12,24],[12,1,12,7],[13,1,13,7],[13,8,13,24],[14,1,14,7],[18,1,18,24],[9,1,9,7],[11,8,11,24],[11,1,11,7],[10,1,10,7],[7,8,7,24],[8,8,8,24],[9,8,9,24],[10,8,10,24],[8,1,8,7],[4,1,4,7],[4,8,4,24],[6,1,6,7],[6,8,6,24],[7,1,7,7]]}
[null,null,null,null,null,null,null,null,null,null,null,null,null,null,null,null,null,null,null,null,null,null,null,null,null,null,null,null,null,null,null,null,"BRB","CB ","FF ","P  ","BBL","BAR","EE ","HVL","LDS","LOS","MOL","OHV","OPR","OSL","PM ","PR ","SPN","TF ","UM ","RLS",null,null,"00","10","20","30","40","50","60","70","80","90"]
[null,"OPTA Generator für npol BOS",null,null,null,null,null,null,null,null,null,null,null,null,null,null,null,null,null,null,null,null,null,null,null,null,null,null,null,null,null,null,"KfSt BRB 00 – Stadt Brandenburg","KfSt CB 00 – Stadt Cottbus","KfSt FF 00 – Stadt Frankfurt/Oder","KfSt P 00 – Stadt Potsdam","Land BB 00","LK BAR 00 – Landkreis","LK EE 00 – Landkreis","LK HVL 00 – Landkreis","LK LDS 00 – Landkreis","LK LOS 00 – Landkreis","LK MOL 00 – Landkreis","LK OHV 00 – Landkreis","LK OPR 00 – Landkreis","LK OSL 00 – Landkreis","LK PM 00 – Landkreis","LK PR 00 – Landkreis","LK SPN 00 – Landkreis","LK TF 00 – Landkreis","LK UM 00 – Landkreis","Regionalleitstelle",null,null,"1. Stellv. Amtsbrandmeister","Abrollbehälter Führung","Flugfeldlöschfahrzeug","DL 16/4","HLF 10 (neue Norm)","GW-Atemschutz","Abrollbehälter","FW-Kran","Arzttruppkraftwagen","ABC-Erkundungskraftwagen"]
[null,"Version 00.01.15, 14.02.2017",null,null,null,null,null,null,null,null,null,null,null,null,null,null,null,null,null,null,null,null,null,null,null,null,null,null,null,null,null,null,"KfSt BRB 01 – Stadt Brandenburg","KfSt CB 01 – Cottbus Wache 1","KfSt FF 01 – Frankfurt/Oder Stadt (BF)","KfSt P 01 – Potsdam Stadt (BF)","Land BB LSTE","LK BAR 01 - Bernau b. Berlin","LK EE 01 - Stadt Bad Liebenwerda","LK HVL 01 - Stadt Falkensee","LK LDS 01 - Stadt Lübben (Spreewald)","LK LOS 01 - Stadt Beeskow","LK MOL 01 - Gemeinde Fredersdorf-Vogelsdorf","LK OHV 01 – Gemeinde Birkenwerder","LK OPR 01 - Stadt Neuruppin","LK OSL 01 - Stadt Lauchhammer/Spreewald","LK PM 01 - Gemeinde Kleinmachnow","LK PR 10 - Stadt Perleberg","LK SPN 01 - Stadt Forst","LK TF 01 - Stadt Luckenwalde","LK UM 01 - Stadt Angermünde",null,null,null,"1. Stellv. Einheitsführer (KatS./BSE/SanE)","Abrollbehälter mobile Fernmeldestelle","Großflughafenlöschfahrzeug","DL 22","HLF 10/6","GWG","Abrollbehälter BHP25","Kleineinsatzfahrzeug","B-NAW (Baby-NAW)","Betreuungs-Kombinationskraftwagen"]
[null,null,null,null,null,null,null,null,null,null,null,null,null,null,null,null,null,null,null,null,null,null,null,null,null,null,null,null,null,null,null,null,"KfSt BRB 08 – Göttin","KfSt CB 02 – Cottbus Wache 2","KfSt FF 02 – Bossen","KfSt P 02 – Babelsberg","Land BB Prüfstelle","LK BAR 02 - Eberswalde","LK EE 02 - Stadt Elsterwerda","LK HVL 02 - Stadt Ketzin","LK LDS 02 – Gemeinde Bestensee","LK LOS 02 - Stadt Eisenhüttenstadt","LK MOL 02 - Gemeinde Neuenhagen b. Berlin","LK OHV 02 – Gemeinde Glienicke/Nordbahn","LK OPR 02 - Stadt Wittstock / Dosse","LK OSL 02 - Stadt Schwarzheide","LK PM 02 - Gemeinde Seddiner See","LK PR 20 - Gemeinde Karstädt","LK SPN 02 - Stadt Guben","LK TF 02 - Stadt Ludwigsfelde","LK UM 02 - Stadt Prenzlau",null,null,null,"1. Stellv. Kreisbrandmeister","ELW 1","sonst. Tanklöschfahrzeuge","DL 30 W 50","HLF 16/12","GW-G 1","Schlauchwagen KatS","Krad","First Responder","Betreuungslastkraftwagen"]
[null,"Anmerkung:",null,null,null,null,null,null,"Eingabefelder sind Auswahllisten",null,null,null,null,null,null,null,null,null,null,null,null,null,null,null,null,null,null,null,null,null,null,null,"KfSt BRB 09 – Schmerzke","KfSt CB 11 – Cottbus Löschbezirk 1","KfSt FF 03 – Güldendorf","KfSt P 03 – Bornim",null,"LK BAR 03 - Gemeinde Ahrensfelde","LK EE 03 - Stadt Finsterwalde","LK HVL 03 - Stadt Nauen","LK LDS 03 – Gemeinde Eichwalde","LK LOS 03 - Stadt Fürstenwalde/Spree","LK MOL 03 - Gemeinde Petershagen-Eggersdorf","LK OHV 03 - Stadt Henningsdorf","LK OPR 03 – Gemeinde Fehrbellin","LK OSL 03 - Stadt Senftenberg","LK PM 03 - Stadt Teltow","LK PR 25 - Gemeinde Groß Pankow","LK SPN 03 - Gemeinde Kolkwitz","LK TF 03 - Gemeinde Nuthe-Urstromtal","LK UM 03 - Stadt Schwedt/Oder",null,null,null,"1. Stellv. Landesbranddirektor","ELW 2","Staffellöschfahrzeug","DL/DLK 12/9","HLF 20 (neue Norm)","GW-G 2","STW","LKW","Gerätewagen Rettungsdienst","CBRN-Erkundungswagen"]
[null,null,null,null,null,null,null,null,null,null,null,null,null,null,null,null,null,null,null,null,null,null,null,null,null,null,null,null,null,null,null,null,"KfSt BRB 10 – Kleinkreutz","KfSt CB 12 – Cottbus Löschbezirk 2","KfSt FF 04 – Hohenwalde","KfSt P 04 – Bornstedt",null,"LK BAR 04 - Gemeinde Schorfheide","LK EE 04 - Stadt Doberlug-Kirchhain","LK HVL 04 - Stadt Premnitz","LK LDS 04 - Stadt Königs Wusterhausen","LK LOS 04 - Stadt Erkner","LK MOL 04 - Stadt Seelow","LK OHV 04 - Stadt Hohen Neuendorf","LK OPR 04 – Gemeinde Heiligengrabe","LK OSL 04 - Amt Altdöbern","LK PM 04 - Stadt Werder","LK PR 30 - Stadt Wittenberge","LK SPN 04 - Stadt Spremberg","LK TF 04 - Gemeinde Am Mellensee","LK UM 04 - Stadt Templin",null,null,null,"1. Stellv. Leiter Berufsfeuerwehr","ELW 3","Tanklöschfahrzeug 2000","DL/DLK 16/4","HLF 20/16","GW-Höhenrettung","SW 1000","Löschboot LB","Großraum RTW","CBRN-Messleitkomponente"]
[null,null,null,null,null,null,null,null,"Auswahl",null,null,null,null,null,null,null,null,null,null,null,null,null,null,null,null,null,"Wert","Bemerkung","Stellen",null,null,null,"KfSt BRB 11 – Kirchmöser","KfSt CB 13 – Cottbus Löschbezirk 3","KfSt FF 05 – Klistow","KfSt P 05 – Drewitz",null,"LK BAR 05 - Amt Biesenthal-Barnim","LK EE 05 - Amt Elsterland","LK HVL 05 - Stadt Rathenow","LK LDS 05 – Gemeinde Schulzendorf","LK LOS 05 - Gemeinde Schöneiche b. Berlin","LK MOL 05 - Stadt Strausberg","LK OHV 05 – Gemeinde Leegebruch","LK OPR 05 - Stadt Kyritz","LK OSL 06 - Stadt Calau","LK PM 05 - Stadt Beelitz","LK PR 35 - Gemeinde Gumtow","LK SPN 05 – Amt Burg","LK TF 05 - Stadt Baruth/Mark","LK UM 06 - Gemeinde Boitzenburger Land",null,null,null,"1. Stellv. Leiter Werkfeuerwehr","FÜKW (DDR Produktion, W353, B1000)","Tanklöschfahrzeug 3000","DL/DLK 18/12","KLF","GW-Licht","SW 12","Mehrzweckboot","Helfer vor Ort","Dekon LKW"]
[null,"Bundesland",null,null,null,null,null,null,"Brandenburg",null,null,null,null,null,null,null,null,null,null,null,null,null,null,null,null,"","BB","fester Wert","1-2",null,null,null,"KfSt BRB 12 – Plaue","KfSt CB 14 – Cottbus Löschbezirk 4","KfSt FF 06 – Lichtenberg","KfSt P 06 – Eiche",null,"LK BAR 06 - Gemeinde Wandlitz","LK EE 06 - Stadt Falkenberg/Elster","LK HVL 06 – Gemeinde Brieselang","LK LDS 06 – Gemeinde Wildau","LK LOS 06 - Gemeinde Woltersdorf","LK MOL 06 - Stadt Altlandsberg","LK OHV 06 - Stadt Oranienburg","LK OPR 06 - Amt Lindow (Mark)","LK OSL 07 - Stadt Großräschen","LK PM 06 - Amt Beetzsee","LK PR 40 - Amt Bad Wilsnack / Weisen","LK SPN 06 – Amt Döbern-Land","LK TF 06 - Gemeinde Blankenfelde-Mahlow","LK UM 07 - Amt Brüssow (Uckermark)",null,null,null,"1. Stellv. Wehrführer","Kommandowagen","Tanklöschfahrzeug 4000","DL/DLK 23/12(DL30)","LF 10 (neue Norm)","GW-Logistik 1","SW 14","RTGW","ITW","Dekontaminationslastkraftwagen, Personen"]
[null,"Organisation",null,null,null,null,null,null,null,null,null,null,null,null,null,null,null,null,null,null,null,null,null,null,null,{"$f":"IF(ISERROR(LOOKUP(I9,Organisation,Werte!C2:C16)),\"\",LOOKUP(I9,Organisation,Werte!C2:C16))","v":""},{"$f":"Z9&REPT(\" \",3-LEN(Z9))","v":"   "},"Organisation, 3 stellig","3-5",null,null,null,"KfSt BRB 13 – Mahlenzien","KfSt CB BSE","KfSt FF 07 – Lossow","KfSt P 07 – Klein-Glienicke",null,"LK BAR 07 - Werneuchen","LK EE 07 - Stadt Herzberg (Elster)","LK HVL 07 – Gemeinde Dallgow-Döberitz","LK LDS 07 – Gemeinde Zeuthen","LK LOS 07 – Amt Brieskow-Finkenherd ","LK MOL 07 - Stadt Bad Freienwalde (Oder)","LK OHV 07 - Stadt Velten","LK OPR 07 - Amt Neustadt / Dosse","LK OSL 08 - Stadt Lübbenau/Spreewald ","LK PM 07 - Stadt Belzig","LK PR 45 - Gemeinde Plattenburg","LK SPN 07 - Stadt Drebkau","LK TF 07 - Amt Dahme/Mark","LK UM 08 - Amt Gartz (Oder)",null,null,null,"2. Stellv. Amtsbrandmeister","LKW 3,5t","Tanklöschfahrzeug 5000","DLA (K) 12/9","LF 10/6","GW-Logistik 2","SW 2000","SEG-Technik","KTW","Dekontaminationslastkraftwagen, Personen 2"]
[null,"Landkreis",null,null,null,null,null,null,null,null,null,null,null,null,null,null,null,null,null,null,null,null,null,null,null,{"$f":"IF(ISERROR(LOOKUP(I10,Landkreis,Werte!E2:E21)),\"\",LOOKUP(I10,Landkreis,Werte!E2:E21))","v":""},{"$f":"Z10&REPT(\" \",3-LEN(Z10))","v":"   "},"Landkreis, 3 stellig","6-8",null,null,null,"KfSt BRB 14 – Gollwitz","KfSt CB Feuerwehr Technisches Zentrum","KfSt FF 08 – Frankfurt/Oder Stadt (FF Mitte)","KfSt P 08 – Sacrow",null,"LK BAR 08 - Amt Joachimsthal-Schorfheide","LK EE 08 – Amt Kleine Elster (Niederlausitz)","LK HVL 08 – Gemeinde Milower Land","LK LDS 08 – Gemeinde Heidsee","LK LOS 08 - Stadt Friedland","LK MOL 08 – Amt Barnim-Oderbruch","LK OHV 08 - Stadt Fürstenberg/Havel","LK OPR 08 - Stadt Rheinsberg","LK OSL 09 - Amt Ortrand","LK PM 08 - Amt Brück","LK PR 50 - Amt Lenzen-Elbaue","LK SPN 10 – Gemeinde Neuhausen/Spree","LK TF 08 - Stadt Jüterbog","LK UM 09 - Amt Gerswalde",null,null,null,"2. Stellv. Einheitsführer (KatS./BSE/SanE)","Luftbeobachter","Tankwagen 18000","DLA (K) 18/9","LF 16","GW-Meß","SW 2000 Tr","Tankwagen/Tankzug","KTW 4-Tragen","Dekontaminationslastkraftwagen, Schnelldekontamination"]
[null,"Örtliche Zuordnung",null,null,null,null,null,null,null,null,null,null,null,null,null,null,null,null,null,null,null,null,null,null,null,{"$f":"IF(ISERROR(LOOKUP(I11,OZ,Werte!G2:G354)),\"\",LOOKUP(I11,OZ,Werte!G2:G354))","v":""},{"$f":"Z11&REPT(\" \",5-LEN(Z11))","v":"     "},"Vgl. erste Teilkennziffern BOS Funk","9-13",null,null,null,"KfSt BRB 15 – Wust","KfSt CB Gefahrstoffeinheit","KfSt FF 09 – Rosengarten","KfSt P 09 – Grube",null,"LK BAR 09 - Amt Britz-Chorin-Oderberg","LK EE 09 - Stadt Mühlberg/Elbe","LK HVL 09 – Gemeinde Schönwalde-Glien","LK LDS 09 – Amt Unterspreewald","LK LOS 09 - Gemeinde Grünheide (Mark)","LK MOL 09 – Amt Falkenberg-Höhe","LK OHV 09 - Amt Gransee","LK OPR 09 - Amt Temnitz","LK OSL 10 - Amt Ruhland","LK PM 11 - Gemeinde Groß Kreutz (Havel)","LK PR 60 - Stadt Pritzwalk","LK SPN 11 - Amt Peitz","LK TF 09 - Gemeinde Großbeeren","LK UM 10 - Amt Gramzow",null,null,null,"2. Stellv. Kreisbrandmeister","Mannschaftstransportfahrzeug","TLF 10/18","DLA (K) 23/12","LF 16/12","GW-Nachschub","SW 3000",null,"KTW Typ B ","Dekontaminationslastkraftwagen, Verletzte"]
[null,"Funktionsbezeichnung\nVorauswahl",null,null,null,null,null,null,null,null,null,null,null,null,null,null,null,null,null,null,null,null,null,null,null,{"$f":"IF(ISERROR(LOOKUP(I12,Funktionsbezeichnung_Vorauswahl,Werte!I2:I11)),\"\",LOOKUP(I12,Funktionsbezeichnung_Vorauswahl,Werte!I2:I11))","v":""},null,"Vorauswahl für das Feld Funktionsbezeichnung","n.a.",null,null,null,"KfSt BRB BSE","KfSt CB Sanitätseinheit","KfSt FF BSE","KfSt P 10 – Potsdam Stadt (FF)",null,"LK BAR 10 - Gemeinde Panketal","LK EE 10 - Amt Plesa","LK HVL 10 – Gemeinde Wustermark","LK LDS 10 – Gemeinde Heideblick","LK LOS 10 – Amt Neuzelle","LK MOL 10 – Amt Golzow","LK OHV 10 - Stadt Kremmen","LK OPR 11 – Gemeinde Wusterhausen / Dosse","LK OSL 11 – Gemeinde Schipkau","LK PM 12 - Gemeinde Kloster Lehnin","LK PR 70 - Amt Putlitz-Berge","LK SPN 12 – Gemeinde Schenkendöbern","LK TF 10 - Gemeinde Niederer Fläming","LK UM 11 - Gemeinde Uckerland",null,null,null,"2. Stellv. Landesbranddirektor","Mannschaftstransportwagen","TLF 10/20","GM","LF 16-TS","GW-Öl","WLF",null,"KTW-A1","ErkW"]
[null,"Funktionsbezeichnung\n(Normbezeichnung)",null,null,null,null,null,null,null,null,null,null,null,null,null,null,null,null,null,null,null,null,null,null,null,{"$f":"IF(ISERROR(LOOKUP(I13,Funktionsbezeichnung,Werte!K2:K210)),\"\",LOOKUP(I13,Funktionsbezeichnung,Werte!K2:K210))","v":""},{"$f":"Z13&REPT(\" \",8-LEN(Z13))","v":"        "},"Normbezeichnung gem. Anlage 3 OPTA Richtlinie (Version 1.4 vom 29.08.2010), 8-stellig","14-21",null,null,null,"KfSt BRB Feuerwehr Technisches Zentrum",null,"KfSt FF Feuerwehr Technisches Zentrum ","KfSt P 11 – Fahrland",null,"LK BAR Brandschutzeinheit","LK EE 11 - Gemeinde Röderland","LK HVL 11 - Amt Friesack","LK LDS 12 - Stadt Luckau","LK LOS 11 – Amt Odervorland","LK MOL 11 - Gemeinde Hoppegarten","LK OHV 11 - Stadt Liebenwalde","LK OPR 13 - Bundeswehr TrübPl WK","LK OSL 12 - Stadt Vetschau/Spreewald","LK PM 13 - Gemeinde Michendorf","LK PR 80 - Amt Meyenburg","LK SPN 13 - Stadt Welzow","LK TF 11 - Gemeinde Niedergörsdorf","LK UM 12 - Stadt Lychen",null,null,null,"2. Stellv. Leiter Berufsfeuerwehr","MTW BHP25","TLF 16 W 50","HAB 18/12","LF 20 (neue Norm)","GW-Strahlenschutz","WLF 18",null,"KTW-A2","Fahrzeug der Rettungshundestaffel"]
[null,"Ordnungskennung",null,null,null,null,null,null,null,null,null,null,null,null,null,null,null,null,null,null,null,null,null,null,null,{"$f":"IF(ISERROR(LOOKUP(I14,Ordnungskennung,Werte!M2:M101)),\"\",LOOKUP(I14,Ordnungskennung,Werte!M2:M101))","v":""},{"$f":"Z14&REPT(\" \",2-LEN(Z14))","v":"  "},"Laufende Nummer","22-23",null,null,null,"KfSt BRB Gefahrstoffeinheit",null,"KfSt FF Gefahrstoffeinheit","KfSt P 12 – Groß Glienicke",null,"LK BAR Feuerwehr Technisches Zentrum","LK EE 12 - Amt Schlieben","LK HVL 12 - Amt Nennhausen","LK LDS 13 – Gemeinde Märkische Heide","LK LOS 12 - Gemeinde Rietz-Neuendorf","LK MOL 12 – Amt Lebus","LK OHV 12 – Gemeinde Löwenberger Land","LK OPR Brandschutzeinheit","LK OSL BASF - BASF Schwartzheide GmbH","LK PM 14 - Amt Niemegk","LK PR Brandschutzeinheit","LK SPN Brandschutzeinheit","LK TF 12 - Gemeinde Rangsdorf","LK UM 13 - Gemeinde Nordwestuckermark",null,null,null,"2. Stellv. Leiter Werkfeuerwehr","MTW FüTr","TLF 16/24 Trupp","HAB 23/12","LF 20/16","GW-Tauchen (TauchEinsatzFahrzeug)","WLF 26",null,"NAW","Gerätewagen Behandlung"]
[null,"Ergänzung / Funkgerät",null,null,null,null,null,null,null,null,null,null,null,null,null,null,null,null,null,null,null,null,null,null,null,{"$f":"IF(ISERROR(LOOKUP(I15,Funkgeraet,Werte!O2:O38)),\"\",LOOKUP(I15,Funkgeraet,Werte!O2:O38))","v":""},{"$f":"Z15&REPT(\" \",1-LEN(Z15))","v":" "},"Ggf. Kennziffer 1 stellig (1-9, A-Z), z.B. Funkgerät","24",null,null,null,"KfSt BRB Sanitätseinheit",null,"KfSt FF Sanitätseinheit","KfSt P 13 – Marquardt",null,"LK BAR Gefahrstoffeinheit","LK EE 13 - Stadt Schönwalde","LK HVL 13 - Amt Rihnow","LK LDS 14 - Stadt Mittenwalde","LK LOS 13 – Amt Scharmützelsee","LK MOL 13 - Gemeinde Letschin","LK OHV 13 – Gemeinde Oberkrämer","LK OPR Feuerwehr Technisches Zentrum","LK OSL Brandschutzeinheit","LK PM 15 - Gemeinde Nuthetal","LK PR Gefahrstoffeinheit","LK SPN Feuerwehr Technisches Zentrum","LK TF 13 - Stadt Trebbin","LK UM 14 - Amt Oder-Welse",null,null,null,"2. Stellv. Wehrführer","MTW SEG Sanität","TLF 16/25","TLK 42","LF 24","GW-Tauchtrupp",null,null,"NEF","Gerätewagen Betreuung"]
{"$rows_left_out":24}
{"sheet":"Werte","index":2,"n_rows":356,"n_cols":17,"rows_kept":356,"cut":false,"hidden":true,"merged":[]}
[null,"Organisation","Wert_Organisation","Landkreis","Werte_Lankreis","OZ","Wert OZ","Funktionsbezeichnung Vorauswahl","Funknamen Vorauswahl","Funktionsbezeichnung","Werte für die OPTA (Zeichen 14 – 21,\n8-stellig)","Ordnungskennung","WERT_Ordnungskennung","Funkgerät","WERT_Funkgerät",null,"Länge#"]
[null,"Arbeiter-Samariter-Bund","ASB","0 - Land BB","BBL","KfSt BRB 00 – Stadt Brandenburg","_00","00 – Leitstelle und Führungskräfte","00","1. Stellv. Amtsbrandmeister","ABM-1","01","_1","    Handsprechfunkgerät ohne Fahrzeugzuordnung","",null,{"$f":"LEN(K2)","v":5}]
[null,"Bergwacht im Deutschen Roten Kreuz","BRG","1 - Brandenburg an der Havel","BRB","KfSt BRB 01 – Stadt Brandenburg","_1","10 – Führungs- und Versorgungsfahrzeuge","10","1. Stellv. Einheitsführer (KatS./BSE/SanE)","EF-1","02","_2"," 1. Handsprechfunkgerät des Fahrzeuges","1",null,{"$f":"LEN(K3)","v":4}]
[null,"Deutsche Lebensrettungs-Gesellschaft","DLR","1 - Cottbus","CB ","KfSt BRB 08 – Göttin","_8","20 – Tank- und Pulverlöschfahrzeuge","20","1. Stellv. Kreisbrandmeister","KBM-1","03","_3"," 2. Handsprechfunkgerät des Fahrzeuges","2",null,5]
[null,"Deutsches Rotes Kreuz","DRK","1 - Frankfurt (Oder)","FF ","KfSt BRB 09 – Schmerzke","_9","30 – Hubrettungsfahrzeuge","30","1. Stellv. Landesbranddirektor","LBD-1","04","_4"," 3. Handsprechfunkgerät des Fahrzeuges","3",null,5]
[null,"Feuerwehr","FW ","1 - Potsdam","P  ","KfSt BRB 10 – Kleinkreutz","_10","40 – Löschgruppen und Tragkraftspritzenfahrzeuge","40","1. Stellv. Leiter Berufsfeuerwehr","LTR.BF-1","05","_5"," 4. Handsprechfunkgerät des Fahrzeuges","4",null,8]
[null,"Innenministerium des Bundes und der Länder","IM","2 - Barnim ","BAR","KfSt BRB 11 – Kirchmöser","_11","50 – Rüst- und Gerätewagen","50","1. Stellv. Leiter Werkfeuerwehr","LTR.WF-1","06","_6"," 5. Handsprechfunkgerät des Fahrzeuges","5",null,8]
[null,"Johanniter Unfallhilfe","JUH","2 - Dahme-Spreewald","LDS","KfSt BRB 12 – Plaue","_12","60 – Schlauchwagen, Wechsellader Fahrzeuge","60","1. Stellv. Wehrführer","WEFÜ-1","07","_7"," 6. Handsprechfunkgerät des Fahrzeuges","6",null,6]
[null,"Katastrophenschutzeinheiten","KAT","2 - Elbe-Elster ","EE ","KfSt BRB 13 – Mahlenzien","_13","70 – Sonstige Fahrzeuge","70","2. Stellv. Amtsbrandmeister","ABM-2","08","_8"," 7. Handsprechfunkgerät des Fahrzeuges","7",null,5]
[null,"Malteser Hilfsdienst","MHD","2 - Havelland ","HVL","KfSt BRB 14 – Gollwitz","_14","80 – Rettungsdienstfahrzeuge","80","2. Stellv. Einheitsführer (KatS./BSE/SanE)","EF-2","09","_9"," 8. Handsprechfunkgerät des Fahrzeuges","8",null,4]
[null,"Regional Leitstellen","RL","2 - Märkisch-Oderland ","MOL","KfSt BRB 15 – Wust","_15","90 – Zur besonderen Verwendung des Bundes / Katastrophenschutz","90","2. Stellv. Kreisbrandmeister","KBM-2","10","10"," 9. Handsprechfunkgerät des Fahrzeuges","9",null,5]
[null,"Rettungshubschrauber","CHR","2 - Oberhavel ","OHV","KfSt BRB BSE","_BSE",null,null,"2. Stellv. Landesbranddirektor","LBD-2","11","11","01. fest verbautes Funkgerät","",null,5]
[null,"Sonstige ","SON","2 - Oberspreewald-Lausitz","OSL","KfSt BRB Feuerwehr Technisches Zentrum","_FTZ",null,null,"2. Stellv. Leiter Berufsfeuerwehr","LTR.BF-2","12","12","02. fest verbautes Funkgerät","A",null,8]
[null,"sonstige anerkannte Rettungsdienste / Kommunaler Rettungsdienst","RD","2 - Oder-Spree ","LOS","KfSt BRB Gefahrstoffeinheit","_GSE",null,null,"2. Stellv. Leiter Werkfeuerwehr","LTR.WF-2","13","13","03. fest verbautes Funkgerät","B",null,8]
[null,"Wasserwacht","WW","2 - Ostprignitz-Ruppin ","OPR","KfSt BRB Sanitätseinheit","_SANE",null,null,"2. Stellv. Wehrführer","WEFÜ-2","14","14","04. fest verbautes Funkgerät","C",null,6]
{"$rows_left_out":342}
{"sheet":"OPTA Tabelle","index":3,"n_rows":103,"n_cols":2,"rows_kept":103,"cut":false,"hidden":false,"merged":[]}
[]
[]
["Nr.","OPTA Tabelle für ASBB"]
[1,"BB                      "]
[2]
[3]
[4]
[5]
[6]
[7]
[8]
[9]
[10]
[11]
[12]
{"$rows_left_out":89}
{"sheet":"STC Hinweise","index":4,"n_rows":36,"n_cols":2,"rows_kept":36,"cut":false,"hidden":true,"merged":[]}
["http://www.office-loesung.de/ftopic267168_0_0_asc.php"]
[null,"MAKRO"]
[]
["http://www.herber.de/forum/archiv/216to220/t216610.htm"]
[null,"rw1 = Cells(Rows.Count, 1).End(xlUp).Row"]
[]
[null,"das ist relativ einfach:"]
[]
[null,"\"rw1\" ist eine Variable die einen Wert aufnehmen soll"]
[null,"\"Cells\" verweist auf die Zellen"]
[null,"\"Rows.Count\" ist eine Funktion welche die Anzahl Zeilen im Tabellenblatt zurückgibt ( = 65536)"]
[null,"\",1\" in welcher Spalte gesucht werden soll ( hier A)"]
[null,"\".End\" weisst EXCEL an, dass es dort beginnen soll zu zählen"]
[null,"\"xlUp\" ist die Richtung in welche EXCEL suchen soll"]
[null,"\".Row\" gibt die erste zeile von unten zurück, wo etwas drinsteht"]
{"$rows_left_out":21}